{"text_format":"1","workbook":"xlsx","n_sheets":3,"sheets":["Notes&Reference","Calculator","Dropdown List"],"not_rendered":{"charts":0,"images":3,"macros":1,"external_links":1,"defined_names":9,"comments":0,"pivot_tables":0},"unopened":[],"bounds":{"document_bytes":16777216,"sheet_cells":100000,"rows_first":2000,"rows_last":500,"rows_between":2000,"halvings":0,"cell_chars":16384,"cell_head_chars":4096},"cells_cut":0,"cells_raw":0,"read":"whole","date_system":"1900"}

{"sheet":"Notes&Reference","index":0,"n_rows":46,"n_cols":25,"rows_kept":46,"cut":false,"hidden":false,"merged":[[1,1,1,7],[2,10,4,10],[2,15,4,15],[1,9,1,18],[2,17,4,17],[2,18,4,18],[2,9,4,9],[2,11,4,11],[2,12,4,12],[2,13,4,13],[2,14,4,14],[2,16,4,16],[2,24,4,24],[1,20,1,24],[2,20,4,20],[2,21,4,21],[2,22,4,22],[2,23,4,23]]}
[]
[null,"Notes on Calculator",null,null,null,null,null,null,null,"Salary Scale Used in Calculator",null,null,null,null,null,null,null,null,null,null,"Oncost Breakdown by Employment Type"]
[null,null,null,null,null,null,null,null,null,"Professional Level & Step","Salary Scale from 2/07/2023","Salary Scale from 2/07/2024","Salary Scale from 2/07/2025","Salary Scale from 18/04/2026","Academic Level & Step","Salary Scale from 2/07/2023","Salary Scale from 2/07/2024","Salary Scale from 2/07/2025","Salary Scale from 18/04/2026",null,"Oncost Breakdown","Current Rate","Continuing & Fixed Term\nSuper Guarantee","Continuing & Fixed Term\nFull Superannuation","Casual\nSuper Guarantee"]
[]
[]
[null,null,null,null,null,null,null,null,null,"HEO1 - 01",53822,55706,57265,58611,"Level A / RES A - 01",83500,86423,88842,90930,null,"Workers Compensation",1.35E-2,"Yes","Yes","Yes"]
[null,null,null,null,null,null,null,null,null,"HEO1 - 02",54992,56917,58511,59886,"Level A / RES A - 02",87666,90735,93275,95467,null,"Payroll Tax",4.9500000000000002E-2,"Yes","Yes","Yes"]
[null,null,null,null,null,null,null,null,null,"HEO1 - 03",56163,58129,59756,61160,"Level A / RES A - 03",91046,94233,96871,99148,null,"Payroll Tax on UniSuper Employer Cont (Accum1)",5.8999999999999999E-3,"Yes",null,"Yes"]
[null,null,null,null,null,null,null,null,null,"HEO2 - 01",57664,59682,61353,62795,"Level A / RES A - 04",94428,97733,100469,102830,null,"Payroll Tax on Unisuper Employer Cont (Accum2)",8.3999999999999995E-3,null,"Yes"]
[null,null,null,null,null,null,null,null,null,"HEO2 - 02",58828,60887,62592,64063,"Level A / RES A - 05",97813,101236,104071,106516,null,"Long Service Leave Levy",0.02,"Yes","Yes","Yes"]
[null,null,null,null,null,null,null,null,null,"HEO2 - 03",60572,62692,64447,65962,"Level A / RES A - 06",101192,104734,107666,110197,null,"Holiday Pay Loading",1.4500000000000001E-2,"Yes","Yes"]
[null,null,null,null,null,null,null,null,null,"HEO2 - 04",61739,63900,65689,67233,"Level B / RES B - 01",106403,110127,113211,115871,null,"Oncost Total",null,{"$f":"V6+V7+V8+V10+V11","v":0.10340000000000001},{"$f":"V6+V7+V9+V10+V11","v":0.10590000000000001},{"$f":"V6+V7+V8+V10","v":8.8900000000000007E-2}]
[null,null,null,null,null,null,null,null,null,"HEO3 - 01",63213,65425,67257,68838,"Level B / RES B - 02",110306,114167,117363,120121,null,"Super Guarantee Levy – UniSuper (Accum1)",0.12,"Yes",null,"Yes"]
[null,null,null,null,null,null,null,null,null,"HEO3 - 02",64959,67232,69115,70739,"Level B / RES B - 03",114201,118198,121508,124363,null,"UniSuper (DBD/Accum2)",0.14000000000000001,null,"Yes"]
[null,null,null,null,null,null,null,null,null,"HEO3 - 03",66698,69033,70966,72633,"Level B / RES B - 04",118109,122243,125666,128619,null,"UniSuper (Accum1)",0.03,null,"Yes"]
[null,null,null,null,null,null,null,null,null,"HEO3 - 04",68434,70829,72812,74523,"Level B / RES B - 05",122010,126280,129816,132866,null,"Super Total",null,{"$f":"V13","v":0.12},{"$f":"V14+V15","v":0.17},{"$f":"V13","v":0.12}]
[null,null,null,null,null,null,null,null,null,"HEO4 - 01",69919,72366,74392,76140,"Level B / RES B - 06",125917,130325,133974,137122,null,"Oncost Total - no Severance",null,{"$f":"W12+W16","v":0.22339999999999999},{"$f":"X12+X16","v":0.27590000000000003},{"$f":"Y12+Y16","v":0.2089}]
[null,null,null,null,null,null,null,null,null,"HEO4 - 02",71080,73568,75628,77405,"Level C / RES C - 01",129818,134362,138124,141370,null,"Severance Pay Levy",0.01,"Yes","Yes"]
[null,null,null,null,null,null,null,null,null,"HEO4 - 03",72234,74762,76855,78661,"Level C / RES C - 02",133724,138404,142279,145623,null,"Oncost Total - with Severance",null,{"$f":"W17+V18","v":0.2334},{"$f":"X17+V18","v":0.28590000000000004},"N/A"]
[null,null,null,null,null,null,null,null,null,"HEO4 - 04",73387,75956,78083,79918,"Level C / RES C - 03",137626,142443,146432,149873]
[null,null,null,null,null,null,null,null,null,"HEO4 - 05",75409,78049,80234,82119,"Level C / RES C - 04",141530,146484,150585,154124]
[null,null,null,null,null,null,null,null,null,"HEO5 - 01",77686,80405,82657,84599,"Level C / RES C - 05",145425,150515,154730,158366]
[null,null,null,null,null,null,null,null,null,"HEO5 - 02",79701,82491,84800,86793,"Level C / RES C - 06",149331,154558,158885,162619]
[null,null,null,null,null,null,null,null,null,"HEO5 - 03",81718,84578,86946,88989,"Level D / RES D - 01",155839,161294,165810,169706]
[null,null,null,null,null,null,null,null,null,"HEO5 - 04",83729,86660,89086,91180,"Level D / RES D - 02",161037,166673,171340,175367]
[null,null,null,null,null,null,null,null,null,"HEO5 - 05",85736,88737,91222,93366,"Level D / RES D - 03",166245,172064,176881,181038]
[null,null,null,null,null,null,null,null,null,"HEO6 - 01",86737,89773,92287,94456,"Level D / RES D - 04",171450,177451,182419,186706]
[null,null,null,null,null,null,null,null,null,"HEO6 - 02",88174,91260,93815,96020,"Level D + - 01",185761,192263,197646,202291]
[null,null,null,null,null,null,null,null,null,"HEO6 - 03",89610,92746,95343,97584,"Level E - 01",200073,207075,212873,217876]
[null,null,null,null,null,null,null,null,null,"HEO6 - 04",91046,94233,96871,99148]
[null,null,null,null,null,null,null,null,null,"HEO6 - 05",92481,95718,98398,100710]
[null,null,null,null,null,null,null,null,null,"HEO7 - 01",94206,97503,100233,102589]
[null,null,null,null,null,null,null,null,null,"HEO7 - 02",96500,99877,102674,105087]
[null,null,null,null,null,null,null,null,null,"HEO7 - 03",98797,102255,105118,107588]
[null,null,null,null,null,null,null,null,null,"HEO7 - 04",101099,104638,107567,110095]
[null,null,null,null,null,null,null,null,null,"HEO7 - 05",104282,107932,110954,113561]
[null,null,null,null,null,null,null,null,null,"HEO8 - 01",106842,110581,113677,116349]
[null,null,null,null,null,null,null,null,null,"HEO8 - 02",111146,115036,118257,121036]
[null,null,null,null,null,null,null,null,null,"HEO8 - 03",115452,119493,122839,125726]
[null,null,null,null,null,null,null,null,null,"HEO8 - 04",118281,122420,125848,128806]
[null,null,null,null,null,null,null,null,null,"HEO9 - 01",122922,127224,130786,133860]
[null,null,null,null,null,null,null,null,null,"HEO9 - 02",127227,131680,135367,138548]
[null,null,null,null,null,null,null,null,null,"HEO9 - 03",131535,136138,139950,143239]
[null,null,null,null,null,null,null,null,null,"HEO10 - 01",135591,140337,144266,147656]
[null,null,null,null,null,null,null,null,null,"HEO10 - 02",139590,144475,148521,152011]
[null,null,null,null,null,null,null,null,null,"HEO10 - 03",143709,148739,152903,156497]

{"sheet":"Calculator","index":1,"n_rows":25,"n_cols":10,"rows_kept":25,"cut":false,"hidden":false,"merged":[[2,2,2,10],[24,3,25,9]]}
[]
[]
[null,null,"Salary & Oncost Calculator (SA Only)"]
[]
[null,null,null,"Select Position Level & Step*:",null,"HEO5 - 05",null,"Enter Position Fraction (%)*",null,100]
[]
[null,null,null,null,null,"Start Date*:",null,"End Date (Default 12 Months if not provided):"]
[null,null,null,"Enter Contract Period*:"]
[null,null,null,"(* Mandatory Field)"]
[]
[null,null,null,"    Cost\n                                          Staff\n                         Position Type",null,"Continuing & Fixed-Term\nSuper Guarantee (12%)",null,"Continuing & Fixed-Term\nFull Super (17%)",null,"Casual Prof & Acad\nSuper Guarantee (12%)"]
[]
[null,null,null,"Salary:",null,{"$f":"IF(OR(ISBLANK(F5), ISBLANK(F8), ISBLANK(J5), AND(COUNTBLANK(H8)=0, F8-H8>0)),\"\", (IF(ISBLANK(H8), IF(F8>='Dropdown List'!J1, (NETWORKDAYS(F8, DATE(YEAR(F8)+1, MONTH(F8), (DAY(F8)-1)))*(VLOOKUP(F5, Level_Step, 6, 0)/260.8333)), (NETWORKDAYS(F8, OFFSET('Dropdown List'!F1, 0, (MATCH(F8, 'Dropdown List'!F1:J1, 1))))*(VLOOKUP(F5, Level_Step, (MATCH(F8, 'Dropdown List'!F1:J1, 1)+1), 0)/260.8333) + NETWORKDAYS(OFFSET('Dropdown List'!F1, 0, (MATCH(F8, 'Dropdown List'!F1:J1, 1))), DATE(YEAR(F8)+1, MONTH(F8), (DAY(F8)-1)))*(VLOOKUP(F5, Level_Step, (MATCH(F8, 'Dropdown List'!F1:J1, 1)+2), 0)/260.8333))), IF(MATCH(F8, 'Dropdown List'!F1:J1, 1)=MATCH(H8, 'Dropdown List'!F1:J1, 1), NETWORKDAYS(F8, H8)*(VLOOKUP(F5, Level_Step, (MATCH(H8, 'Dropdown List'!F1:J1, 1)+1), 0)/260.8333), (NETWORKDAYS(F8, OFFSET('Dropdown List'!F1, 0, (MATCH(F8, 'Dropdown List'!F1:J1, 1))))*(VLOOKUP(F5, Level_Step, (MATCH(F8, 'Dropdown List'!F1:J1, 1)+1), 0)/260.8333) + NETWORKDAYS(OFFSET('Dropdown List'!F1, 0, ((MATCH(H8, 'Dropdown List'!F1:J1, 1))-1)), H8)*(VLOOKUP(F5, Level_Step, (MATCH(H8, 'Dropdown List'!F1:J1, 1)+1), 0)/260.8333)+(IF(MATCH(H8, 'Dropdown List'!F1:J1, 1)-MATCH(F8, 'Dropdown List'!F1:J1, 1)<2, 0, IF(MATCH(H8, 'Dropdown List'!F1:J1, 1)-MATCH(F8, 'Dropdown List'!F1:J1, 1)=3, GH_SALARY+HI_SALARY, IF(MATCH(H8, 'Dropdown List'!F1:J1, 1)=4, HI_SALARY, GH_SALARY))))))))*J5/100)","v":""},null,{"$f":"IF(OR(ISBLANK(F5), ISBLANK(F8), ISBLANK(J5), AND(COUNTBLANK(H8)=0, F8-H8>0)),\"\", (IF(ISBLANK(H8), IF(F8>='Dropdown List'!J1, (NETWORKDAYS(F8, DATE(YEAR(F8)+1, MONTH(F8), (DAY(F8)-1)))*(VLOOKUP(F5, Level_Step, 6, 0)/260.8333)), (NETWORKDAYS(F8, OFFSET('Dropdown List'!F1, 0, (MATCH(F8, 'Dropdown List'!F1:J1, 1))))*(VLOOKUP(F5, Level_Step, (MATCH(F8, 'Dropdown List'!F1:J1, 1)+1), 0)/260.8333) + NETWORKDAYS(OFFSET('Dropdown List'!F1, 0, (MATCH(F8, 'Dropdown List'!F1:J1, 1))), DATE(YEAR(F8)+1, MONTH(F8), (DAY(F8)-1)))*(VLOOKUP(F5, Level_Step, (MATCH(F8, 'Dropdown List'!F1:J1, 1)+2), 0)/260.8333))), IF(MATCH(F8, 'Dropdown List'!F1:J1, 1)=MATCH(H8, 'Dropdown List'!F1:J1, 1), NETWORKDAYS(F8, H8)*(VLOOKUP(F5, Level_Step, (MATCH(H8, 'Dropdown List'!F1:J1, 1)+1), 0)/260.8333), (NETWORKDAYS(F8, OFFSET('Dropdown List'!F1, 0, (MATCH(F8, 'Dropdown List'!F1:J1, 1))))*(VLOOKUP(F5, Level_Step, (MATCH(F8, 'Dropdown List'!F1:J1, 1)+1), 0)/260.8333) + NETWORKDAYS(OFFSET('Dropdown List'!F1, 0, ((MATCH(H8, 'Dropdown List'!F1:J1, 1))-1)), H8)*(VLOOKUP(F5, Level_Step, (MATCH(H8, 'Dropdown List'!F1:J1, 1)+1), 0)/260.8333)+(IF(MATCH(H8, 'Dropdown List'!F1:J1, 1)-MATCH(F8, 'Dropdown List'!F1:J1, 1)<2, 0, IF(MATCH(H8, 'Dropdown List'!F1:J1, 1)-MATCH(F8, 'Dropdown List'!F1:J1, 1)=3, GH_SALARY+HI_SALARY, IF(MATCH(H8, 'Dropdown List'!F1:J1, 1)=4, HI_SALARY, GH_SALARY))))))))*J5/100)","v":""},null,{"$f":"IF(OR(ISBLANK(F5), ISBLANK(F8), ISBLANK(J5), AND(COUNTBLANK(H8)=0, F8-H8>0), LEFT(F5,1)=\"L\"),\"\", (IF(ISBLANK(H8), IF(F8>='Dropdown List'!J1, (NETWORKDAYS(F8, DATE(YEAR(F8)+1, MONTH(F8), (DAY(F8)-1)))*(VLOOKUP(REPLACE(F5,IF(MID(F5,5,1)=\" \", 9, 10),1,1), Level_Step, 6, 0)/260.8333*1.25)), (NETWORKDAYS(F8, OFFSET('Dropdown List'!F1, 0, (MATCH(F8, 'Dropdown List'!F1:J1, 1))))*(VLOOKUP(REPLACE(F5,IF(MID(F5,5,1)=\" \", 9, 10),1,1), Level_Step, (MATCH(F8, 'Dropdown List'!F1:J1, 1)+1), 0)/260.8333*1.25) + NETWORKDAYS(OFFSET('Dropdown List'!F1, 0, (MATCH(F8, 'Dropdown List'!F1:J1, 1))), DATE(YEAR(F8)+1, MONTH(F8), (DAY(F8)-1)))*(VLOOKUP(REPLACE(F5,IF(MID(F5,5,1)=\" \", 9, 10),1,1), Level_Step, (MATCH(F8, 'Dropdown List'!F1:J1, 1)+2), 0)/260.8333*1.25))), IF(MATCH(F8, 'Dropdown List'!F1:J1, 1)=MATCH(H8, 'Dropdown List'!F1:J1, 1), NETWORKDAYS(F8, H8)*(VLOOKUP(REPLACE(F5,IF(MID(F5,5,1)=\" \", 9, 10),1,1), Level_Step, (MATCH(H8, 'Dropdown List'!F1:J1, 1)+1), 0)/260.8333*1.25), (NETWORKDAYS(F8, OFFSET('Dropdown List'!F1, 0, (MATCH(F8, 'Dropdown List'!F1:J1, 1))))*(VLOOKUP(REPLACE(F5,IF(MID(F5,5,1)=\" \", 9, 10),1,1), Level_Step, (MATCH(F8, 'Dropdown List'!F1:J1, 1)+1), 0)/260.8333*1.25) + NETWORKDAYS(OFFSET('Dropdown List'!F1, 0, (MATCH(H8, 'Dropdown List'!F1:J1, 1)-1)), H8)*(VLOOKUP(REPLACE(F5,IF(MID(F5,5,1)=\" \", 9, 10),1,1), Level_Step, (MATCH(H8, 'Dropdown List'!F1:J1, 1)+1), 0)/260.8333*1.25)+(IF(MATCH(H8, 'Dropdown List'!F1:J1, 1)-MATCH(F8, 'Dropdown List'!F1:J1, 1)<2, 0, IF(MATCH(H8, 'Dropdown List'!F1:J1, 1)-MATCH(F8, 'Dropdown List'!F1:J1, 1)=3, GH_SALARY_CASUAL+HI_SALARY_CASUAL, IF(MATCH(H8, 'Dropdown List'!F1:J1, 1)=4, HI_SALARY_CASUAL, GH_SALARY_CASUAL))))))))*J5/100)","v":""}]
[]
[null,null,null,"Super:",null,{"$f":"IF(F13=\"\",\"\", F13*'Dropdown List'!B3)","v":""},null,{"$f":"IF(H13=\"\",\"\", H13*'Dropdown List'!B4)","v":""},null,{"$f":"IF(J13=\"\",\"\", J13*'Dropdown List'!B2)","v":""}]
[]
[null,null,null,"Oncost - no Severance",null,{"$f":"IF(F13=\"\",\"\", F13*'Dropdown List'!C5)","v":""},null,{"$f":"IF(H13=\"\",\"\", H13*'Dropdown List'!C6)","v":""},null,{"$f":"IF(J13=\"\",\"\", J13*'Dropdown List'!C2)","v":""}]
[]
[null,null,null,"Oncost - with Severance",null,{"$f":"IF(F13=\"\",\"\", F13*'Dropdown List'!C3)","v":""},null,{"$f":"IF(H13=\"\",\"\", H13*'Dropdown List'!C4)","v":""}]
[]
[null,null,null,"Total Cost - no Severance",null,{"$f":"IF(F13=\"\",\"\", SUM(F13,F15,F17))","v":""},null,{"$f":"IF(H13=\"\", \"\", SUM(H13,H15,H17))","v":""},null,{"$f":"IF(J13=\"\", \"\", SUM(J13,J15,J17))","v":""}]
[]
[null,null,null,"Total Cost - with Severance",null,{"$f":"IF(F13=\"\",\"\", SUM(F13,F15,F19))","v":""},null,{"$f":"IF(H13=\"\", \"\", SUM(H13,H15,H19))","v":""}]
[]
[null,null,null,"*Disclaimer: This calculator is to be used as a guide only. Cost is calculated for the contract period specified based on the Level & Step selected (i.e. not including future increments if contract > 12 months). See Notes & Reference Worksheet for more information."]

{"sheet":"Dropdown List","index":2,"n_rows":66,"n_cols":10,"rows_kept":66,"cut":false,"hidden":true,"merged":[]}
["Select Staff Position Type","Super%","Oncost%",null,"Level & Step","2022-07-02","2023-07-02","2024-07-02","2025-07-02","2026-04-18"]
["Professional Casual and Academic Casual Teaching (no Sev, no HPL)",0.12,8.8900000000000007E-2,null,"HEO1 - 01",51455,53822,55706,57265,58611]
["SGC Super + Severance",0.12,0.1134,null,"HEO1 - 02",52574,54992,56917,58511,59886]
["Full Super + Severance",0.17,0.1159,null,"HEO1 - 03",53693,56163,58129,59756,61160]
["SGC Super, No Severance",0.12,0.10340000000000001,null,"HEO2 - 01",55128,57664,59682,61353,62795]
["Full Super, No Severance",0.17,0.10589999999999999,null,"HEO2 - 02",56241,58828,60887,62592,64063]
[null,null,null,null,"HEO2 - 03",57908,60572,62692,64447,65962]
[null,null,null,null,"HEO2 - 04",59024,61739,63900,65689,67233]
[null,null,null,null,"HEO3 - 01",60433,63213,65425,67257,68838]
[null,null,null,null,"HEO3 - 02",62102,64959,67232,69115,70739]
[null,null,null,null,"HEO3 - 03",63765,66698,69033,70966,72633]
[null,null,null,null,"HEO3 - 04",65424,68434,70829,72812,74523]
[null,null,null,null,"HEO4 - 01",66844,69919,72366,74392,76140]
[null,null,null,null,"HEO4 - 02",67954,71080,73568,75628,77405]
[null,null,null,null,"HEO4 - 03",69057,72234,74762,76855,78661]
[null,null,null,null,"HEO4 - 04",70160,73387,75956,78083,79918]
[null,null,null,null,"HEO4 - 05",72093,75409,78049,80234,82119]
[null,null,null,null,"HEO5 - 01",74270,77686,80405,82657,84599]
[null,null,null,null,"HEO5 - 02",76196,79701,82491,84800,86793]
[null,null,null,null,"HEO5 - 03",78124,81718,84578,86946,88989]
[null,null,null,null,"HEO5 - 04",80047,83729,86660,89086,91180]
[null,null,null,null,"HEO5 - 05",81966,85736,88737,91222,93366]
[null,null,null,null,"HEO6 - 01",82923,86737,89773,92287,94456]
[null,null,null,null,"HEO6 - 02",84296,88174,91260,93815,96020]
[null,null,null,null,"HEO6 - 03",85669,89610,92746,95343,97584]
[null,null,null,null,"HEO6 - 04",87042,91046,94233,96871,99148]
[null,null,null,null,"HEO6 - 05",88414,92481,95718,98398,100710]
[null,null,null,null,"HEO7 - 01",90063,94206,97503,100233,102589]
[null,null,null,null,"HEO7 - 02",92256,96500,99877,102674,105087]
[null,null,null,null,"HEO7 - 03",94452,98797,102255,105118,107588]
[null,null,null,null,"HEO7 - 04",96653,101099,104638,107567,110095]
[null,null,null,null,"HEO7 - 05",99696,104282,107932,110954,113561]
[null,null,null,null,"HEO8 - 01",102143,106842,110581,113677,116349]
[null,null,null,null,"HEO8 - 02",106258,111146,115036,118257,121036]
[null,null,null,null,"HEO8 - 03",110375,115452,119493,122839,125726]
[null,null,null,null,"HEO8 - 04",113079,118281,122420,125848,128806]
[null,null,null,null,"HEO9 - 01",117516,122922,127224,130786,133860]
[null,null,null,null,"HEO9 - 02",121632,127227,131680,135367,138548]
[null,null,null,null,"HEO9 - 03",125750,131535,136138,139950,143239]
[null,null,null,null,"HEO10 - 01",129628,135591,140337,144266,147656]
[null,null,null,null,"HEO10 - 02",133451,139590,144475,148521,152011]
[null,null,null,null,"HEO10 - 03",137389,143709,148739,152903,156497]
[null,null,null,null,"Level A / RES A - 01",79828,83500,86423,88842,90930]
[null,null,null,null,"Level A / RES A - 02",83811,87666,90735,93275,95467]
[null,null,null,null,"Level A / RES A - 03",87042,91046,94233,96871,99148]
[null,null,null,null,"Level A / RES A - 04",90275,94428,97733,100469,102830]
[null,null,null,null,"Level A / RES A - 05",93511,97813,101236,104071,106516]
[null,null,null,null,"Level A / RES A - 06",96742,101192,104734,107666,110197]
[null,null,null,null,"Level B / RES B - 01",101724,106403,110127,113211,115871]
[null,null,null,null,"Level B / RES B - 02",105455,110306,114167,117363,120121]
[null,null,null,null,"Level B / RES B - 03",109179,114201,118198,121508,124363]
[null,null,null,null,"Level B / RES B - 04",112915,118109,122243,125666,128619]
[null,null,null,null,"Level B / RES B - 05",116644,122010,126280,129816,132866]
[null,null,null,null,"Level B / RES B - 06",120380,125917,130325,133974,137122]
[null,null,null,null,"Level C / RES C - 01",124109,129818,134362,138124,141370]
[null,null,null,null,"Level C / RES C - 02",127843,133724,138404,142279,145623]
[null,null,null,null,"Level C / RES C - 03",131574,137626,142443,146432,149873]
[null,null,null,null,"Level C / RES C - 04",135306,141530,146484,150585,154124]
[null,null,null,null,"Level C / RES C - 05",139030,145425,150515,154730,158366]
[null,null,null,null,"Level C / RES C - 06",142764,149331,154558,158885,162619]
[null,null,null,null,"Level D / RES D - 01",148986,155839,161294,165810,169706]
[null,null,null,null,"Level D / RES D - 02",153955,161037,166673,171340,175367]
[null,null,null,null,"Level D / RES D - 03",158934,166245,172064,176881,181038]
[null,null,null,null,"Level D / RES D - 04",163910,171450,177451,182419,186706]
[null,null,null,null,"Level D + - 01",177592,185761,192263,197646,202291]
[null,null,null,null,"Level E - 01",191274,200073,207075,212873,217876]